[bcn-pm] Falla con el CPAN Bundle::Bugzilla
unimauro
unimauro at yahoo.com.mx
Sat Dec 27 16:50:15 CST 2003
Holas
Gente tengo fallas en el proceso de instalación del CPAN
perl -MCPAN -e'install "Bundle::Bugzilla"'
:(
Saludos
t/dbi............ok 3/63Use of uninitialized value in join or string at
/usr/lib/perl5/site_perl/5.8.1/i386-linux-thread-multi/DBI.pm line 1271,
<DATA> line 1.
t/dbi............ok 5/63Use of uninitialized value in join or string at
/usr/lib/perl5/site_perl/5.8.1/i386-linux-thread-multi/DBI.pm line 1271,
<DATA> line 1.
t/dbi............ok 7/63Use of uninitialized value in join or string at
/usr/lib/perl5/site_perl/5.8.1/i386-linux-thread-multi/DBI.pm line 1271,
<DATA> line 1.
t/dbi............ok 9/63Use of uninitialized value in join or string at
/usr/lib/perl5/site_perl/5.8.1/i386-linux-thread-multi/DBI.pm line 1271,
<DATA> line 1.
t/dbi............ok 13/63Template process failed: DBI error - DBI
connect failed: Unknown MySQL Server Host 'test' (1)
FAILED 14: - template text 6 process FAILED: [% USE dbi -%]\n[%
dbi.connect(da...
FAILED 15: - (obviously did not match expected)
t/dbi............ok 17/63Use of uninitialized value in join or string at
/usr/lib/perl5/site_perl/5.8.1/i386-linux-thread-multi/DBI.pm line 1271,
<DATA> line 1.t/dbi............ok 19/63Use of uninitialized value in
join or string at
/usr/lib/perl5/site_perl/5.8.1/i386-linux-thread-multi/DBI.pm line 1271,
<DATA> line 1.t/dbi............ok 21/63Use of uninitialized value in
join or string at
/usr/lib/perl5/site_perl/5.8.1/i386-linux-thread-multi/DBI.pm line 1271,
<DATA> line 1.Use of uninitialized value in join or string at
/usr/lib/perl5/site_perl/5.8.1/i386-linux-thread-multi/DBI.pm line 1271,
<DATA> line 1.
t/dbi............ok 23/63Use of uninitialized value in join or string at
/usr/lib/perl5/site_perl/5.8.1/i386-linux-thread-multi/DBI.pm line 1271,
<DATA> line 1.t/dbi............ok 25/63Use of uninitialized value in
join or string at
/usr/lib/perl5/site_perl/5.8.1/i386-linux-thread-multi/DBI.pm line 1271,
<DATA> line 1.t/dbi............ok 27/63Use of uninitialized value in
join or string at
/usr/lib/perl5/site_perl/5.8.1/i386-linux-thread-multi/DBI.pm line 1271,
<DATA> line 1.t/dbi............ok 29/63Use of uninitialized value in
join or string at
/usr/lib/perl5/site_perl/5.8.1/i386-linux-thread-multi/DBI.pm line 1271,
<DATA> line 1.t/dbi............ok 31/63Use of uninitialized value in
join or string at
/usr/lib/perl5/site_perl/5.8.1/i386-linux-thread-multi/DBI.pm line 1271,
<DATA> line 1.t/dbi............ok 33/63Use of uninitialized value in
join or string at
/usr/lib/perl5/site_perl/5.8.1/i386-linux-thread-multi/DBI.pm line 1271,
<DATA> line 1.t/dbi............ok 37/63Use of uninitialized value in
join or string at
/usr/lib/perl5/site_perl/5.8.1/i386-linux-thread-multi/DBI.pm line 1271,
<DATA> line 1.t/dbi............ok 39/63Use of uninitialized value in
join or string at
/usr/lib/perl5/site_perl/5.8.1/i386-linux-thread-multi/DBI.pm line 1271,
<DATA> line 1.t/dbi............ok 41/63Use of uninitialized value in
join or string at
/usr/lib/perl5/site_perl/5.8.1/i386-linux-thread-multi/DBI.pm line 1271,
<DATA> line 1.t/dbi............ok 43/63Use of uninitialized value in
join or string at
/usr/lib/perl5/site_perl/5.8.1/i386-linux-thread-multi/DBI.pm line 1271,
<DATA> line 1.t/dbi............ok 47/63Use of uninitialized value in
join or string at
/usr/lib/perl5/site_perl/5.8.1/i386-linux-thread-multi/DBI.pm line 1271,
<DATA> line 1.t/dbi............ok 49/63Use of uninitialized value in
join or string at
/usr/lib/perl5/site_perl/5.8.1/i386-linux-thread-multi/DBI.pm line 1271,
<DATA> line 1.t/dbi............ok 51/63Use of uninitialized value in
join or string at
/usr/lib/perl5/site_perl/5.8.1/i386-linux-thread-multi/DBI.pm line 1271,
<DATA> line 1.t/dbi............ok 53/63Use of uninitialized value in
join or string at
/usr/lib/perl5/site_perl/5.8.1/i386-linux-thread-multi/DBI.pm line 1271,
<DATA> line 1.t/dbi............FAILED tests 14-15
Failed 2/63 tests, 96.83% okay
y al final sale:
Failed Test Stat Wstat Total Fail Failed List of Failed
-------------------------------------------------------------------------------
t/autoform.t 25 3 12.00% 21 23 25
t/dbi.t 63 2 3.17% 14-15
1 test skipped.
Failed 2/90 test scripts, 97.78% okay. 5/2682 subtests failed, 99.81%
okay.
make: *** [test_dynamic] Error 255
/usr/bin/make test -- NOT OK
Running make install
make test had returned bad status, won't install without force
Text::Wrap is up to date.
Bundle summary: The following items in bundle Bundle::Bugzilla had
installation problems:
Template
algun comentario :P
--
+----------+-------------------------------------------+
| .---. | www.unimauro.pe.kz || www.perupymes.net |
| |º_º| | Carlos Mauro Cárdenas Fernández |
| |:_/| |*irc.freenode.net #apesol |
| // \\ |*irc.gimp.org #gnome-hispano |
|(| |) | 051-001-4582877 || 051-001-97079624 |
|/'\_ _/'\ | Jr.Las Cidras 664, Lima Peru |
|\__) (__/ |*Lo hacemos por diversion."Linus T" |
|__________|___________________________________________|
More information about the Barcelona-pm
mailing list